Reaction Details
TargetProto-oncogene tyrosine-protein kinase Src
LigandBDBM50313061
Substrate/Competitorn/a
Meas. Tech.ChEMBL_616311 (CHEMBL1102114)
Ki>4000±n/a nM
Citation Arnost, MPierce, Ater Haar, ELauffer, DMadden, JTanner, KGreen, J 3-Aryl-4-(arylhydrazono)-1H-pyrazol-5-ones: Highly ligand efficient and potent inhibitors of GSK3beta. Bioorg Med Chem Lett20:1661-4 (2010) 
 
Proto-oncogene tyrosine-protein kinase Src
Name:Proto-oncogene tyrosine-protein kinase Src
Type:Protein
Mol. Mass.:59838.60
Organism:Homo sapiens (Human)
Description:P12931
Residue:536
BDBM50313061
NameBDBM50313061
Synonyms:(Z)-3-(4-methoxypyridin-3-yl)-4-(2-phenylhydrazono)-1H-pyrazol-5(4H)-one | CHEMBL1086736
TypeSmall organic molecule
Emp. Form.C15H13N5O2
Mol. Mass.295.296
SMILESCOc1ccncc1-c1[nH][nH]c(=O)c1N=Nc1ccccc1