Reaction Details
TargetTyrosine-protein kinase SYK
LigandBDBM50313061
Substrate/Competitorn/a
Meas. Tech.ChEMBL_616312 (CHEMBL1102115)
Ki 1800±n/a nM
Citation Arnost, MPierce, Ater Haar, ELauffer, DMadden, JTanner, KGreen, J 3-Aryl-4-(arylhydrazono)-1H-pyrazol-5-ones: Highly ligand efficient and potent inhibitors of GSK3beta. Bioorg Med Chem Lett20:1661-4 (2010) 
 
Tyrosine-protein kinase SYK
Name:Tyrosine-protein kinase SYK
Type:Enzyme
Mol. Mass.:72079.99
Organism:Homo sapiens (Human)
Description:P43405
Residue:635
BDBM50313061
NameBDBM50313061
Synonyms:(Z)-3-(4-methoxypyridin-3-yl)-4-(2-phenylhydrazono)-1H-pyrazol-5(4H)-one | CHEMBL1086736
TypeSmall organic molecule
Emp. Form.C15H13N5O2
Mol. Mass.295.296
SMILESCOc1ccncc1-c1[nH][nH]c(=O)c1N=Nc1ccccc1