Reaction Details
TargetGlycogen synthase kinase-3 beta
LigandBDBM50313015
Substrate/Competitorn/a
Meas. Tech.ChEMBL_616299 (CHEMBL1102102)
Ki 1490±n/a nM
Citation Arnost, MPierce, Ater Haar, ELauffer, DMadden, JTanner, KGreen, J 3-Aryl-4-(arylhydrazono)-1H-pyrazol-5-ones: Highly ligand efficient and potent inhibitors of GSK3beta. Bioorg Med Chem Lett20:1661-4 (2010) 
 
Glycogen synthase kinase-3 beta
Name:Glycogen synthase kinase-3 beta
Type:Enzyme
Mol. Mass.:46756.38
Organism:Homo sapiens (Human)
Description:P49841
Residue:420
BDBM50313015
NameBDBM50313015
Synonyms:4-(2-(2-chlorophenyl)hydrazono)-1H-pyrazol-5(4H)-one | CHEMBL1080868
TypeSmall organic molecule
Emp. Form.C9H7ClN4O
Mol. Mass.222.631
SMILESClc1ccccc1N=Nc1c[nH][nH]c1=O