Reaction Details
TargetGlycogen synthase kinase-3 beta
LigandBDBM50313023
Substrate/Competitorn/a
Meas. Tech.ChEMBL_616299 (CHEMBL1102102)
Ki 44±n/a nM
Citation Arnost, MPierce, Ater Haar, ELauffer, DMadden, JTanner, KGreen, J 3-Aryl-4-(arylhydrazono)-1H-pyrazol-5-ones: Highly ligand efficient and potent inhibitors of GSK3beta. Bioorg Med Chem Lett20:1661-4 (2010) 
 
Glycogen synthase kinase-3 beta
Name:Glycogen synthase kinase-3 beta
Type:Enzyme
Mol. Mass.:46756.38
Organism:Homo sapiens (Human)
Description:P49841
Residue:420
BDBM50313023
NameBDBM50313023
Synonyms:(Z)-4-(2-(2-chlorophenyl)hydrazono)-3-(3,4-dimethoxyphenyl)-1H-pyrazol-5(4H)-one | CHEMBL1081429
TypeSmall organic molecule
Emp. Form.C17H15ClN4O3
Mol. Mass.358.779
SMILESCOc1ccc(cc1OC)-c1[nH][nH]c(=O)c1N=Nc1ccccc1Cl