Reaction Details
TargetKinesin-like protein KIF11
LigandBDBM50313430
Substrate/Competitorn/a
Meas. Tech.ChEMBL_617338 (CHEMBL1101849)
IC50 4±n/a nM
Citation Schiemann, KFinsinger, DZenke, FAmendt, CKnöchel, TBruge, DBuchstaller, HPEmde, UStähle, WAnzali, S The discovery and optimization of hexahydro-2H-pyrano[3,2-c]quinolines (HHPQs) as potent and selective inhibitors of the mitotic kinesin-5. Bioorg Med Chem Lett20:1491-5 (2010) 
 
Kinesin-like protein KIF11
Name:Kinesin-like protein KIF11
Type:PROTEIN
Mol. Mass.:119138.97
Organism:Homo sapiens (Human)
Description:ChEMBL_1457426
Residue:1056
BDBM50313430
NameBDBM50313430
Synonyms:2-(methylamino)-N-(((2R,4aS,5R,10bS)-5-phenyl-9-(trifluoromethyl)-3,4,4a,5,6,10b-hexahydro-2H-pyrano[3,2-c]quinolin-2-yl)methyl)ethanesulfonamide | CHEMBL1084677
TypeSmall organic molecule
Emp. Form.C23H28F3N3O3S
Mol. Mass.483.547
SMILESCNCCS(=O)(=O)NC[C@H]1CC[C@H]2[C@@H](Nc3ccc(cc3[C@H]2O1)C(F)(F)F)c1ccccc1