Reaction Details
TargetSodium-dependent noradrenaline transporter
LigandBDBM50313549
Substrate/Competitorn/a
Meas. Tech.ChEMBL_617684 (CHEMBL1101480)
IC50 3±n/a nM
Citation Fensome, AGoldberg, JMcComas, CCTrybulski, EJWoodworth, RPDeecher, DCWhiteside, GTZhang, P Structure-activity relationships of norepinephrine reuptake inhibitors with benzothiadiazine dioxide or dihydrosulfostyril cores. Bioorg Med Chem Lett20:1555-8 (2010) 
 
Sodium-dependent noradrenaline transporter
Name:Sodium-dependent noradrenaline transporter
Type:Multi-pass membrane protein
Mol. Mass.:69337.72
Organism:Homo sapiens (Human)
Description:P23975
Residue:617
BDBM50313549
NameBDBM50313549
Synonyms:CHEMBL1085197 {3-[1-(2-Fluoro-phenyl)-2,2-dioxo-1,2,3,4-tetrahydro-2lambda*6*-benzo[c][1,2]thiazin-3-yl]-propyl}-methyl-amine
TypeSmall organic molecule
Emp. Form.C18H21FN2O2S
Mol. Mass.348.435
SMILESCNCCCC1Cc2ccccc2N(c2ccccc2F)S1(=O)=O