Reaction Details
TargetReceptor-type tyrosine-protein kinase FLT3
LigandBDBM50313607
Substrate/Competitorn/a
Meas. Tech.ChEMBL_614228 (CHEMBL1106056)
IC50>10000±n/a nM
Citation Choi, SJMoon, MJLee, SDChoi, SUHan, SYKim, YC Indirubin derivatives as potent FLT3 inhibitors with anti-proliferative activity of acute myeloid leukemic cells. Bioorg Med Chem Lett20:2033-7 (2010) 
 
Receptor-type tyrosine-protein kinase FLT3
Name:Receptor-type tyrosine-protein kinase FLT3
Type:Enzyme
Mol. Mass.:112888.62
Organism:Homo sapiens (Human)
Description:P36888
Residue:993
BDBM50313607
NameBDBM50313607
Synonyms:5'-Chloro-7'-methyl-1H,1'H-[2,3']biindolylidene-3,2'-dione 3-oxime | CHEMBL1095686
TypeSmall organic molecule
Emp. Form.C17H12ClN3O2
Mol. Mass.325.749
SMILESCc1cc(Cl)cc2C(C(=O)Nc12)c1[nH]c2ccccc2c1N=O