Reaction Details
TargetReceptor-type tyrosine-protein kinase FLT3
LigandBDBM7492
Substrate/Competitorn/a
Meas. Tech.ChEMBL_614228 (CHEMBL1106056)
IC50 418±n/a nM
Citation Choi, SJMoon, MJLee, SDChoi, SUHan, SYKim, YC Indirubin derivatives as potent FLT3 inhibitors with anti-proliferative activity of acute myeloid leukemic cells. Bioorg Med Chem Lett20:2033-7 (2010) 
 
Receptor-type tyrosine-protein kinase FLT3
Name:Receptor-type tyrosine-protein kinase FLT3
Type:Enzyme
Mol. Mass.:112888.62
Organism:Homo sapiens (Human)
Description:P36888
Residue:993
BDBM7492
NameBDBM7492
Synonyms:3-[(2Z,3E)-3-(hydroxyimino)-2,3-dihydro-1H-indol-2-ylidene]-5-iodo-2,3-dihydro-1H-indol-2-one | 5-Iodo-indirubin-3 -monoxime
TypeSmall organic molecule
Emp. Form.C16H10IN3O2
Mol. Mass.403.174
SMILESIc1ccc2NC(=O)C(c2c1)c1[nH]c2ccccc2c1N=O