Reaction Details
TargetReceptor-type tyrosine-protein kinase FLT3
LigandBDBM50304109
Substrate/Competitorn/a
Meas. Tech.ChEMBL_614228 (CHEMBL1106056)
IC50 62±n/a nM
Citation Choi, SJMoon, MJLee, SDChoi, SUHan, SYKim, YC Indirubin derivatives as potent FLT3 inhibitors with anti-proliferative activity of acute myeloid leukemic cells. Bioorg Med Chem Lett20:2033-7 (2010) 
 
Receptor-type tyrosine-protein kinase FLT3
Name:Receptor-type tyrosine-protein kinase FLT3
Type:Enzyme
Mol. Mass.:112888.62
Organism:Homo sapiens (Human)
Description:P36888
Residue:993
BDBM50304109
NameBDBM50304109
Synonyms:(Z)-5'-Nitro-1H,1'H-[2,3']biindolylidene-3,2'-dione 3-oxime CHEMBL471250
TypeSmall organic molecule
Emp. Form.C16H10N4O4
Mol. Mass.322.275
SMILES[O-][N+](=O)c1ccc2NC(=O)C(c2c1)c1[nH]c2ccccc2c1N=O