Reaction Details
TargetReceptor-type tyrosine-protein kinase FLT3
LigandBDBM50313614
Substrate/Competitorn/a
Meas. Tech.ChEMBL_614228 (CHEMBL1106056)
IC50 209±n/a nM
Citation Choi, SJMoon, MJLee, SDChoi, SUHan, SYKim, YC Indirubin derivatives as potent FLT3 inhibitors with anti-proliferative activity of acute myeloid leukemic cells. Bioorg Med Chem Lett20:2033-7 (2010) 
 
Receptor-type tyrosine-protein kinase FLT3
Name:Receptor-type tyrosine-protein kinase FLT3
Type:Enzyme
Mol. Mass.:112888.62
Organism:Homo sapiens (Human)
Description:P36888
Residue:993
BDBM50313614
NameBDBM50313614
Synonyms:5'-Methyl-1H,1'H-[2,3']biindolylidene-3,2'-dione | CHEMBL1084938
TypeSmall organic molecule
Emp. Form.C17H12N2O2
Mol. Mass.276.2894
SMILESCc1ccc2NC(=O)\C(=C3/Nc4ccccc4C3=O)c2c1