Reaction Details
TargetEpidermal growth factor receptor
LigandBDBM50314077
Substrate/Competitorn/a
Meas. Tech.ChEMBL_627419 (CHEMBL1115349)
IC50 10410±n/a nM
Citation Gangjee, AZaware, NRaghavan, SIhnat, MShenoy, SKisliuk, RL Single agents with designed combination chemotherapy potential: synthesis and evaluation of substituted pyrimido[4,5-b]indoles as receptor tyrosine kinase and thymidylate synthase inhibitors and as antitumor agents. J Med Chem53:1563-78 (2010) 
 
Epidermal growth factor receptor
Name:Epidermal growth factor receptor
Type:Receptor Kinase Domain
Mol. Mass.:134279.59
Organism:Homo sapiens (Human)
Description:P00533
Residue:1210
BDBM50314077
NameBDBM50314077
Synonyms:5-(p-tolylthio)-9H-pyrimido[4,5-b]indole-2,4-diamine US9422297, AAG-148-311
TypeSmall organic molecule
Emp. Form.C17H15N5S
Mol. Mass.321.4
SMILESCc1ccc(Sc2cccc3[nH]c4nc(N)nc(N)c4c23)cc1