Reaction Details
TargetCarbonic anhydrase 1
LigandBDBM50314540
Substrate/Competitorn/a
Meas. Tech.ChEMBL_625070 (CHEMBL1112519)
Ki 3210±n/a nM
Citation Lopez, MBornaghi, LFInnocenti, AVullo, DCharman, SASupuran, CTPoulsen, SA Sulfonamide linked neoglycoconjugates--a new class of inhibitors for cancer-associated carbonic anhydrases. J Med Chem53:2913-26 (2010) 
 
Carbonic anhydrase 1
Name:Carbonic anhydrase 1
Type:Enzyme
Mol. Mass.:28873.37
Organism:Homo sapiens (Human)
Description:P00915
Residue:261
BDBM50314540
NameBDBM50314540
Synonyms:CHEMBL1089370 | Methyl N-4-(Aminosulfonyl)phenethyl-S-(2,3,4-tri-O-acetyl-1-thio-beta-D-glucopyranuronoyl)sulfonamide
TypeSmall organic molecule
Emp. Form.C21H28N2O13S2
Mol. Mass.580.583
SMILESCOC(=O)[C@H]1O[C@H]([C@H](OC(C)=O)[C@@H](OC(C)=O)[C@H]1OC(C)=O)S(=O)(=O)NCCc1ccc(cc1)S(N)(=O)=O