Reaction Details
TargetCarbonic anhydrase 9
LigandBDBM50314554
Substrate/Competitorn/a
Meas. Tech.ChEMBL_625072 (CHEMBL1112521)
Ki 107±n/a nM
Citation Lopez, MBornaghi, LFInnocenti, AVullo, DCharman, SASupuran, CTPoulsen, SA Sulfonamide linked neoglycoconjugates--a new class of inhibitors for cancer-associated carbonic anhydrases. J Med Chem53:2913-26 (2010) 
 
Carbonic anhydrase 9
Name:Carbonic anhydrase 9
Type:Enzyme
Mol. Mass.:49669.03
Organism:Homo sapiens (Human)
Description:Catalytic domain of human cloned isozyme was used in the assay
Residue:459
BDBM50314554
NameBDBM50314554
Synonyms:CHEMBL1091780 | N-4-(Aminosulfonyl)phenethyl-S-(2,3,4,6-tetra-O-acetyl-1-thio-beta-D-galactopyranosyl)sulfenamide
TypeSmall organic molecule
Emp. Form.C22H30N2O11S2
Mol. Mass.562.61
SMILESCC(=O)OC[C@H]1O[C@@H](SNCCc2ccc(cc2)S(N)(=O)=O)[C@H](OC(C)=O)[C@@H](OC(C)=O)[C@H]1OC(C)=O