Reaction Details
TargetCarbonic anhydrase 9
LigandBDBM12918
Substrate/Competitorn/a
Meas. Tech.ChEMBL_625072 (CHEMBL1112521)
Ki 430±n/a nM
Citation Lopez, MBornaghi, LFInnocenti, AVullo, DCharman, SASupuran, CTPoulsen, SA Sulfonamide linked neoglycoconjugates--a new class of inhibitors for cancer-associated carbonic anhydrases. J Med Chem53:2913-26 (2010) 
 
Carbonic anhydrase 9
Name:Carbonic anhydrase 9
Type:Enzyme
Mol. Mass.:49669.03
Organism:Homo sapiens (Human)
Description:Catalytic domain of human cloned isozyme was used in the assay
Residue:459
BDBM12918
NameBDBM12918
Synonyms:4-({[4-(Aminosulfonyl)benzoyl]amino}methyl-1-(2,3,4,6-tetra-O-acetyl-beta-D-glucopyranosyl)-1H-1,2,3-triazole Glycoconjugate Benzene Sulfonamide 2a | [(2R,3R,4S,5R,6R)-3,4,5-tris(acetyloxy)-6-(4-{[(4-sulfamoylphenyl)formamido]methyl}-1H-1,2,3-triazol-1-yl)oxan-2-yl]methyl acetate
TypeSmall organic molecule
Emp. Form.C24H29N5O12S
Mol. Mass.611.578
SMILESCC(=O)OC[C@H]1O[C@H]([C@H](OC(C)=O)[C@@H](OC(C)=O)[C@@H]1OC(C)=O)n1cc(CNC(=O)c2ccc(cc2)S(N)(=O)=O)nn1