Reaction Details
TargetCarbonic anhydrase 2
LigandBDBM50314543
Substrate/Competitorn/a
Meas. Tech.ChEMBL_625071 (CHEMBL1112520)
Ki 7.1±n/a nM
Citation Lopez, MBornaghi, LFInnocenti, AVullo, DCharman, SASupuran, CTPoulsen, SA Sulfonamide linked neoglycoconjugates--a new class of inhibitors for cancer-associated carbonic anhydrases. J Med Chem53:2913-26 (2010) 
 
Carbonic anhydrase 2
Name:Carbonic anhydrase 2
Type:Enzyme
Mol. Mass.:29250.71
Organism:Homo sapiens (Human)
Description:P00918
Residue:260
BDBM50314543
NameBDBM50314543
Synonyms:CHEMBL1088997 | N-(4-Aminosulfonyl)benzyl-S-(1-thio-beta-D-glucopyranuronoyl)-sulfonamide
TypeSmall organic molecule
Emp. Form.C13H18N2O10S2
Mol. Mass.426.419
SMILESNS(=O)(=O)c1ccc(CNS(=O)(=O)[C@@H]2O[C@@H]([C@H](O)[C@H](O)[C@H]2O)C(O)=O)cc1