Reaction Details
TargetCarbonic anhydrase 2
LigandBDBM12919
Substrate/Competitorn/a
Meas. Tech.ChEMBL_625071 (CHEMBL1112520)
Ki 8.2±n/a nM
Citation Lopez, MBornaghi, LFInnocenti, AVullo, DCharman, SASupuran, CTPoulsen, SA Sulfonamide linked neoglycoconjugates--a new class of inhibitors for cancer-associated carbonic anhydrases. J Med Chem53:2913-26 (2010) 
 
Carbonic anhydrase 2
Name:Carbonic anhydrase 2
Type:Enzyme
Mol. Mass.:29250.71
Organism:Homo sapiens (Human)
Description:P00918
Residue:260
BDBM12919
NameBDBM12919
Synonyms:4-({[4-(Aminosulfonyl)benzoyl]amino}methyl-1-(beta-D-glucopyranosyl)-1H-1,2,3-triazole CHEMBL385152 | Glycoconjugate Benzene Sulfonamide 2aa
TypeSmall organic molecule
Emp. Form.C16H21N5O8S
Mol. Mass.443.432
SMILESNS(=O)(=O)c1ccc(cc1)C(=O)NCc1cn(nn1)[C@@H]1O[C@H](CO)[C@@H](O)[C@H](O)[C@H]1O