Reaction Details
TargetCarbonic anhydrase 12
LigandBDBM50314528
Substrate/Competitorn/a
Meas. Tech.ChEMBL_625073 (CHEMBL1112522)
Ki 8.5±n/a nM
Citation Lopez, MBornaghi, LFInnocenti, AVullo, DCharman, SASupuran, CTPoulsen, SA Sulfonamide linked neoglycoconjugates--a new class of inhibitors for cancer-associated carbonic anhydrases. J Med Chem53:2913-26 (2010) 
 
Carbonic anhydrase 12
Name:Carbonic anhydrase 12
Type:Enzyme
Mol. Mass.:39456.00
Organism:Homo sapiens (Human)
Description:Catalytic domain of human cloned isozyme was used in the assay
Residue:354
BDBM50314528
NameBDBM50314528
Synonyms:CHEMBL1091319 | N-4-(Aminosulfonyl)benzyl-S-(2,2',3,3',4',6,6'-hepta-O-acetyl-1-thio-beta-lactosyl)sulfenamide
TypeSmall organic molecule
Emp. Form.C33H44N2O19S2
Mol. Mass.836.834
SMILESCC(=O)OC[C@H]1O[C@@H](SNCc2ccc(cc2)S(N)(=O)=O)[C@H](OC(C)=O)[C@@H](OC(C)=O)[C@@H]1O[C@H]1O[C@H](COC(C)=O)[C@@H](OC(C)=O)[C@H](OC(C)=O)[C@H]1OC(C)=O