Reaction Details
TargetCarbonic anhydrase 12
LigandBDBM50314530
Substrate/Competitorn/a
Meas. Tech.ChEMBL_625073 (CHEMBL1112522)
Ki 8.7±n/a nM
Citation Lopez, MBornaghi, LFInnocenti, AVullo, DCharman, SASupuran, CTPoulsen, SA Sulfonamide linked neoglycoconjugates--a new class of inhibitors for cancer-associated carbonic anhydrases. J Med Chem53:2913-26 (2010) 
 
Carbonic anhydrase 12
Name:Carbonic anhydrase 12
Type:Enzyme
Mol. Mass.:39456.00
Organism:Homo sapiens (Human)
Description:Catalytic domain of human cloned isozyme was used in the assay
Residue:354
BDBM50314530
NameBDBM50314530
Synonyms:CHEMBL1092374 | N-(4-Aminosulfonyl)benzyl-S-(1-thio-beta-D-galactopyranosyl)-sulfonamide
TypeSmall organic molecule
Emp. Form.C13H20N2O9S2
Mol. Mass.412.436
SMILESNS(=O)(=O)c1ccc(CNS(=O)(=O)[C@@H]2O[C@H](CO)[C@H](O)[C@H](O)[C@H]2O)cc1