Reaction Details
TargetCarbonic anhydrase 12
LigandBDBM50314555
Substrate/Competitorn/a
Meas. Tech.ChEMBL_625073 (CHEMBL1112522)
Ki 9.3±n/a nM
Citation Lopez, MBornaghi, LFInnocenti, AVullo, DCharman, SASupuran, CTPoulsen, SA Sulfonamide linked neoglycoconjugates--a new class of inhibitors for cancer-associated carbonic anhydrases. J Med Chem53:2913-26 (2010) 
 
Carbonic anhydrase 12
Name:Carbonic anhydrase 12
Type:Enzyme
Mol. Mass.:39456.00
Organism:Homo sapiens (Human)
Description:Catalytic domain of human cloned isozyme was used in the assay
Residue:354
BDBM50314555
NameBDBM50314555
Synonyms:CHEMBL1093729 | N-4-(Aminosulfonyl)benzyl-S-(2,3,4,6-tetra-O-acetyl-1-thio-beta-D-glucopyranosyl)sulfonamide
TypeSmall organic molecule
Emp. Form.C21H28N2O13S2
Mol. Mass.580.583
SMILESCC(=O)OC[C@H]1O[C@H]([C@H](OC(C)=O)[C@@H](OC(C)=O)[C@@H]1OC(C)=O)S(=O)(=O)NCc1ccc(cc1)S(N)(=O)=O