Reaction Details
TargetCarbonic anhydrase 12
LigandBDBM50314535
Substrate/Competitorn/a
Meas. Tech.ChEMBL_625073 (CHEMBL1112522)
Ki 9.5±n/a nM
Citation Lopez, MBornaghi, LFInnocenti, AVullo, DCharman, SASupuran, CTPoulsen, SA Sulfonamide linked neoglycoconjugates--a new class of inhibitors for cancer-associated carbonic anhydrases. J Med Chem53:2913-26 (2010) 
 
Carbonic anhydrase 12
Name:Carbonic anhydrase 12
Type:Enzyme
Mol. Mass.:39456.00
Organism:Homo sapiens (Human)
Description:Catalytic domain of human cloned isozyme was used in the assay
Residue:354
BDBM50314535
NameBDBM50314535
Synonyms:CHEMBL1091781 | Methyl N-4-(Aminosulfonyl)phenethyl-S-(2,3,4-tri-O-acetyl-1-thio-beta-D-glucopyranuronoyl)sulfenamide
TypeSmall organic molecule
Emp. Form.C21H28N2O11S2
Mol. Mass.548.584
SMILESCOC(=O)[C@H]1O[C@@H](SNCCc2ccc(cc2)S(N)(=O)=O)[C@H](OC(C)=O)[C@@H](OC(C)=O)[C@H]1OC(C)=O