Reaction Details
TargetCarbonic anhydrase 12
LigandBDBM50314534
Substrate/Competitorn/a
Meas. Tech.ChEMBL_625073 (CHEMBL1112522)
Ki 9.5±n/a nM
Citation Lopez, MBornaghi, LFInnocenti, AVullo, DCharman, SASupuran, CTPoulsen, SA Sulfonamide linked neoglycoconjugates--a new class of inhibitors for cancer-associated carbonic anhydrases. J Med Chem53:2913-26 (2010) 
 
Carbonic anhydrase 12
Name:Carbonic anhydrase 12
Type:Enzyme
Mol. Mass.:39456.00
Organism:Homo sapiens (Human)
Description:Catalytic domain of human cloned isozyme was used in the assay
Residue:354
BDBM50314534
NameBDBM50314534
Synonyms:CHEMBL1090030 | N-4-(Aminosulfonyl)phenethyl-S-(2,3,4,6-tetra-O-acetyl-1-thio-beta-D-glucopyranosyl)sulfonamide
TypeSmall organic molecule
Emp. Form.C22H30N2O13S2
Mol. Mass.594.609
SMILESCC(=O)OC[C@H]1O[C@H]([C@H](OC(C)=O)[C@@H](OC(C)=O)[C@@H]1OC(C)=O)S(=O)(=O)NCCc1ccc(cc1)S(N)(=O)=O