Reaction Details
TargetCarbonic anhydrase 9
LigandBDBM50314537
Substrate/Competitorn/a
Meas. Tech.ChEMBL_625072 (CHEMBL1112521)
Ki 93±n/a nM
Citation Lopez, MBornaghi, LFInnocenti, AVullo, DCharman, SASupuran, CTPoulsen, SA Sulfonamide linked neoglycoconjugates--a new class of inhibitors for cancer-associated carbonic anhydrases. J Med Chem53:2913-26 (2010) 
 
Carbonic anhydrase 9
Name:Carbonic anhydrase 9
Type:Enzyme
Mol. Mass.:49669.03
Organism:Homo sapiens (Human)
Description:Catalytic domain of human cloned isozyme was used in the assay
Residue:459
BDBM50314537
NameBDBM50314537
Synonyms:CHEMBL1093298 | N-4-(Aminosulfonyl)phenethyl-S-(2,2',3,3',4',6,6'-hepta-O-acetyl-1-thio-beta-maltosyl)sulfonamide
TypeSmall organic molecule
Emp. Form.C34H46N2O21S2
Mol. Mass.882.86
SMILESCC(=O)OC[C@H]1O[C@H]([C@H](OC(C)=O)[C@@H](OC(C)=O)[C@@H]1O[C@H]1O[C@H](COC(C)=O)[C@@H](OC(C)=O)[C@H](OC(C)=O)[C@H]1OC(C)=O)S(=O)(=O)NCCc1ccc(cc1)S(N)(=O)=O