Reaction Details
TargetCarbonic anhydrase 9
LigandBDBM50314539
Substrate/Competitorn/a
Meas. Tech.ChEMBL_625072 (CHEMBL1112521)
Ki 95±n/a nM
Citation Lopez, MBornaghi, LFInnocenti, AVullo, DCharman, SASupuran, CTPoulsen, SA Sulfonamide linked neoglycoconjugates--a new class of inhibitors for cancer-associated carbonic anhydrases. J Med Chem53:2913-26 (2010) 
 
Carbonic anhydrase 9
Name:Carbonic anhydrase 9
Type:Enzyme
Mol. Mass.:49669.03
Organism:Homo sapiens (Human)
Description:Catalytic domain of human cloned isozyme was used in the assay
Residue:459
BDBM50314539
NameBDBM50314539
Synonyms:CHEMBL1091806 | N-(4-Aminosulfonyl)benzyl-S-(1-thio-beta-D-glucopyranosyl)sulfonamide
TypeSmall organic molecule
Emp. Form.C13H20N2O9S2
Mol. Mass.412.436
SMILESNS(=O)(=O)c1ccc(CNS(=O)(=O)[C@@H]2O[C@H](CO)[C@@H](O)[C@H](O)[C@H]2O)cc1