Reaction Details
TargetCarbonic anhydrase 1
LigandBDBM50314542
Substrate/Competitorn/a
Meas. Tech.ChEMBL_625070 (CHEMBL1112519)
Ki 97±n/a nM
Citation Lopez, MBornaghi, LFInnocenti, AVullo, DCharman, SASupuran, CTPoulsen, SA Sulfonamide linked neoglycoconjugates--a new class of inhibitors for cancer-associated carbonic anhydrases. J Med Chem53:2913-26 (2010) 
 
Carbonic anhydrase 1
Name:Carbonic anhydrase 1
Type:Enzyme
Mol. Mass.:28873.37
Organism:Homo sapiens (Human)
Description:P00915
Residue:261
BDBM50314542
NameBDBM50314542
Synonyms:(2S,3R,4S,5R,6S)-3,4,5-trihydroxy-6-(N-(4-sulfamoylphenethyl)sulfamoyl)tetrahydro-2H-pyran-2-carboxylic acid | CHEMBL1090010
TypeSmall organic molecule
Emp. Form.C14H20N2O10S2
Mol. Mass.440.446
SMILESNS(=O)(=O)c1ccc(CCNS(=O)(=O)[C@@H]2O[C@@H]([C@H](O)[C@H](O)[C@H]2O)C(O)=O)cc1