Reaction Details
TargetCarbonic anhydrase 1
LigandBDBM50314526
Substrate/Competitorn/a
Meas. Tech.ChEMBL_625070 (CHEMBL1112519)
Ki 102±n/a nM
Citation Lopez, MBornaghi, LFInnocenti, AVullo, DCharman, SASupuran, CTPoulsen, SA Sulfonamide linked neoglycoconjugates--a new class of inhibitors for cancer-associated carbonic anhydrases. J Med Chem53:2913-26 (2010) 
 
Carbonic anhydrase 1
Name:Carbonic anhydrase 1
Type:Enzyme
Mol. Mass.:28873.37
Organism:Homo sapiens (Human)
Description:P00915
Residue:261
BDBM50314526
NameBDBM50314526
Synonyms:CHEMBL1090012 | N-4-(Aminosulfonyl)phenethyl-S-(1-thio-beta-lactosyl)sulfonamide
TypeSmall organic molecule
Emp. Form.C20H32N2O14S2
Mol. Mass.588.603
SMILESNS(=O)(=O)c1ccc(CCNS(=O)(=O)[C@@H]2O[C@H](CO)[C@@H](O[C@H]3O[C@H](CO)[C@@H](O)[C@H](O)[C@H]3O)[C@H](O)[C@H]2O)cc1