Reaction Details
TargetVesicular acetylcholine transporter
LigandBDBM50378714
Substrate/Competitorn/a
Meas. Tech.ChEMBL_627490 (CHEMBL1111776)
Ki 1.83±n/a nM
Citation Efange, SMKhare, ABvon Hohenberg, KMach, RHParsons, SMTu, Z Synthesis and in vitro biological evaluation of carbonyl group-containing inhibitors of vesicular acetylcholine transporter. J Med Chem53:2825-35 (2010) 
 
Vesicular acetylcholine transporter
Name:Vesicular acetylcholine transporter
Type:PROTEIN
Mol. Mass.:56111.93
Organism:Torpedo californica
Description:ChEMBL_1503355
Residue:515
BDBM50378714
NameBDBM50378714
Synonyms:CHEMBL1204028
TypeSmall organic molecule
Emp. Form.C28H28FNO2
Mol. Mass.429.5258
SMILESO[C@@H]1Cc2ccccc2C[C@H]1N1CCC(CC1)(C(=O)c1ccc(F)cc1)c1ccccc1