Reaction Details
TargetVesicular acetylcholine transporter
LigandBDBM50378725
Substrate/Competitorn/a
Meas. Tech.ChEMBL_627490 (CHEMBL1111776)
Ki 2.4±n/a nM
Citation Efange, SMKhare, ABvon Hohenberg, KMach, RHParsons, SMTu, Z Synthesis and in vitro biological evaluation of carbonyl group-containing inhibitors of vesicular acetylcholine transporter. J Med Chem53:2825-35 (2010) 
 
Vesicular acetylcholine transporter
Name:Vesicular acetylcholine transporter
Type:PROTEIN
Mol. Mass.:56111.93
Organism:Torpedo californica
Description:ChEMBL_1503355
Residue:515
BDBM50378725
NameBDBM50378725
Synonyms:CHEMBL1204039
TypeSmall organic molecule
Emp. Form.C22H25FN2O2
Mol. Mass.368.4445
SMILESNc1cccc2C[C@@H](O)[C@@H](Cc12)N1CCC(CC1)C(=O)c1ccc(F)cc1