Reaction Details
TargetVesicular acetylcholine transporter
LigandBDBM50378728
Substrate/Competitorn/a
Meas. Tech.ChEMBL_627490 (CHEMBL1111776)
Ki 0.41±n/a nM
Citation Efange, SMKhare, ABvon Hohenberg, KMach, RHParsons, SMTu, Z Synthesis and in vitro biological evaluation of carbonyl group-containing inhibitors of vesicular acetylcholine transporter. J Med Chem53:2825-35 (2010) 
 
Vesicular acetylcholine transporter
Name:Vesicular acetylcholine transporter
Type:PROTEIN
Mol. Mass.:56111.93
Organism:Torpedo californica
Description:ChEMBL_1503355
Residue:515
BDBM50378728
NameBDBM50378728
Synonyms:CHEMBL1204042
TypeSmall organic molecule
Emp. Form.C20H23BrN2O2S
Mol. Mass.435.378
SMILESNc1cccc2C[C@@H](O)[C@@H](Cc12)N1CCC(CC1)C(=O)c1ccc(Br)s1