Reaction Details
TargetMu-type opioid receptor
LigandBDBM50314883
Substrate/Competitorn/a
Meas. Tech.ChEMBL_627495 (CHEMBL1111781)
IC50 647±n/a nM
Citation Weltrowska, GChung, NNLemieux, CGuo, JLu, YWilkes, BCSchiller, PW "Carba"-analogues of fentanyl are opioid receptor agonists. J Med Chem53:2875-81 (2010) 
 
Mu-type opioid receptor
Name:Mu-type opioid receptor
Type:Enzyme Catalytic Domain
Mol. Mass.:11165.58
Organism:GUINEA PIG
Description:P97266
Residue:98
BDBM50314883
NameBDBM50314883
Synonyms:CHEMBL1089546 | N-(3-Methylbenzyl)-N-(1-phenylethylpiperidine-4-yl)propionamide
TypeSmall organic molecule
Emp. Form.C24H32N2O
Mol. Mass.364.5237
SMILESCCC(=O)N(Cc1cccc(C)c1)C1CCN(CCc2ccccc2)CC1