Reaction Details
TargetDelta-type opioid receptor
LigandBDBM50314883
Substrate/Competitorn/a
Meas. Tech.ChEMBL_627496 (CHEMBL1111782)
IC50 610±n/a nM
Citation Weltrowska, GChung, NNLemieux, CGuo, JLu, YWilkes, BCSchiller, PW "Carba"-analogues of fentanyl are opioid receptor agonists. J Med Chem53:2875-81 (2010) 
 
Delta-type opioid receptor
Name:Delta-type opioid receptor
Type:Enzyme Catalytic Domain
Mol. Mass.:40577.25
Organism:MOUSE
Description:P32300
Residue:372
BDBM50314883
NameBDBM50314883
Synonyms:CHEMBL1089546 | N-(3-Methylbenzyl)-N-(1-phenylethylpiperidine-4-yl)propionamide
TypeSmall organic molecule
Emp. Form.C24H32N2O
Mol. Mass.364.5237
SMILESCCC(=O)N(Cc1cccc(C)c1)C1CCN(CCc2ccccc2)CC1