Reaction Details
TargetHistone-lysine N-methyltransferase SETD7
LigandBDBM50378739
Substrate/Competitorn/a
Meas. Tech.ChEMBL_627737 (CHEMBL1116159)
IC50 2500±n/a nM
Citation Dowden, JHong, WParry, RVPike, RAWard, SG Toward the development of potent and selective bisubstrate inhibitors of protein arginine methyltransferases. Bioorg Med Chem Lett20:2103-5 (2010) 
 
Histone-lysine N-methyltransferase SETD7
Name:Histone-lysine N-methyltransferase SETD7
Type:Enzyme
Mol. Mass.:40691.12
Organism:Homo sapiens (Human)
Description:Q8WTS6
Residue:366
BDBM50378739
NameBDBM50378739
Synonyms:SINEFUNGIN | jm2c00120, Sinefungin
TypeSmall organic molecule
Emp. Form.C15H23N7O5
Mol. Mass.381.387
SMILESN[C@@H](CC[C@H](N)C(O)=O)C[C@H]1O[C@H]([C@H](O)[C@@H]1O)n1cnc2c(N)ncnc12