Reaction Details
TargetSialidase-2
LigandBDBM50314986
Substrate/Competitorn/a
Meas. Tech.ChEMBL_623928 (CHEMBL1108053)
Ki 1400000±n/a nM
Citation Chavas, LMKato, RSuzuki, Nvon Itzstein, MMann, MCThomson, RJDyason, JCMcKimm-Breschkin, JFusi, PTringali, CVenerando, BTettamanti, GMonti, EWakatsuki, S Complexity in influenza virus targeted drug design: interaction with human sialidases. J Med Chem53:2998-3002 (2010) 
 
Sialidase-2
Name:Sialidase-2
Type:PROTEIN
Mol. Mass.:42256.20
Organism:Homo sapiens (Human)
Description:ChEMBL_960638
Residue:380
BDBM50314986
NameBDBM50314986
Synonyms:(2S,3R,4R)-3-acetamido-2-(2,3-dihydroxypropoxy)-4-hydroxy-3,4-dihydro-2H-pyran-6-carboxylic acid | CHEMBL1090839
TypeSmall organic molecule
Emp. Form.C11H17NO8
Mol. Mass.291.2546
SMILESCC(=O)N[C@@H]1[C@H](O)C=C(O[C@@H]1OCC(O)CO)C(O)=O