Reaction Details
TargetHistamine H4 receptor
LigandBDBM50315316
Substrate/Competitorn/a
Meas. Tech.ChEMBL_625969 (CHEMBL1103488)
IC50 10000±n/a nM
Citation Cramp, SDyke, HJHiggs, CClark, DEGill, MSavy, PJennings, NPrice, SLockey, PMNorman, DPorres, SWilson, FJones, ARamsden, NMangano, RLeggate, DAndersson, MHale, R Identification and hit-to-lead exploration of a novel series of histamine H4 receptor inverse agonists. Bioorg Med Chem Lett20:2516-9 (2010) 
 
Histamine H4 receptor
Name:Histamine H4 receptor
Type:G Protein-Coupled Receptor (GPCR)
Mol. Mass.:44517.02
Organism:Homo sapiens (Human)
Description:Binding assays were using CHO cells stably expressing hH4R receptors.
Residue:390
BDBM50315316
NameBDBM50315316
Synonyms:8-chloro-4-(3,4,5-trimethylpiperazin-1-yl)benzofuro[3,2-d]pyrimidine | CHEMBL1092331
TypeSmall organic molecule
Emp. Form.C17H19ClN4O
Mol. Mass.330.812
SMILESCC1CN(CC(C)N1C)c1ncnc2c1oc1ccc(Cl)cc21