Reaction Details
TargetHistamine H4 receptor
LigandBDBM50315322
Substrate/Competitorn/a
Meas. Tech.ChEMBL_625969 (CHEMBL1103488)
IC50 95±n/a nM
Citation Cramp, SDyke, HJHiggs, CClark, DEGill, MSavy, PJennings, NPrice, SLockey, PMNorman, DPorres, SWilson, FJones, ARamsden, NMangano, RLeggate, DAndersson, MHale, R Identification and hit-to-lead exploration of a novel series of histamine H4 receptor inverse agonists. Bioorg Med Chem Lett20:2516-9 (2010) 
 
Histamine H4 receptor
Name:Histamine H4 receptor
Type:G Protein-Coupled Receptor (GPCR)
Mol. Mass.:44517.02
Organism:Homo sapiens (Human)
Description:Binding assays were using CHO cells stably expressing hH4R receptors.
Residue:390
BDBM50315322
NameBDBM50315322
Synonyms:1-(8-chlorobenzofuro[3,2-d]pyrimidin-4-yl)-N-methylpyrrolidin-3-amine | CHEMBL1088889
TypeSmall organic molecule
Emp. Form.C15H15ClN4O
Mol. Mass.302.759
SMILESCNC1CCN(C1)c1ncnc2c3cc(Cl)ccc3oc12