Reaction Details
TargetHistamine H4 receptor
LigandBDBM50315333
Substrate/Competitorn/a
Meas. Tech.ChEMBL_625969 (CHEMBL1103488)
IC50 30±n/a nM
Citation Cramp, SDyke, HJHiggs, CClark, DEGill, MSavy, PJennings, NPrice, SLockey, PMNorman, DPorres, SWilson, FJones, ARamsden, NMangano, RLeggate, DAndersson, MHale, R Identification and hit-to-lead exploration of a novel series of histamine H4 receptor inverse agonists. Bioorg Med Chem Lett20:2516-9 (2010) 
 
Histamine H4 receptor
Name:Histamine H4 receptor
Type:G Protein-Coupled Receptor (GPCR)
Mol. Mass.:44517.02
Organism:Homo sapiens (Human)
Description:Binding assays were using CHO cells stably expressing hH4R receptors.
Residue:390
BDBM50315333
NameBDBM50315333
Synonyms:(R)-N-methyl-1-(8-(trifluoromethyl)benzofuro[3,2-d]pyrimidin-4-yl)pyrrolidin-3-amine | CHEMBL1088859
TypeSmall organic molecule
Emp. Form.C16H15F3N4O
Mol. Mass.336.3117
SMILESCN[C@@H]1CCN(C1)c1ncnc2c3cc(ccc3oc12)C(F)(F)F