Reaction Details
TargetHistamine H4 receptor
LigandBDBM50315337
Substrate/Competitorn/a
Meas. Tech.ChEMBL_625969 (CHEMBL1103488)
IC50>30000±n/a nM
Citation Cramp, SDyke, HJHiggs, CClark, DEGill, MSavy, PJennings, NPrice, SLockey, PMNorman, DPorres, SWilson, FJones, ARamsden, NMangano, RLeggate, DAndersson, MHale, R Identification and hit-to-lead exploration of a novel series of histamine H4 receptor inverse agonists. Bioorg Med Chem Lett20:2516-9 (2010) 
 
Histamine H4 receptor
Name:Histamine H4 receptor
Type:G Protein-Coupled Receptor (GPCR)
Mol. Mass.:44517.02
Organism:Homo sapiens (Human)
Description:Binding assays were using CHO cells stably expressing hH4R receptors.
Residue:390
BDBM50315337
NameBDBM50315337
Synonyms:CHEMBL1092881 | N-methyl-4-(3-(methylamino)pyrrolidin-1-yl)benzofuro[3,2-d]pyrimidine-8-carboxamide
TypeSmall organic molecule
Emp. Form.C17H19N5O2
Mol. Mass.325.3651
SMILESCNC1CCN(C1)c1ncnc2c3cc(ccc3oc12)C(=O)NC