Reaction Details
TargetHistamine H4 receptor
LigandBDBM50315345
Substrate/Competitorn/a
Meas. Tech.ChEMBL_625969 (CHEMBL1103488)
IC50>10000±n/a nM
Citation Cramp, SDyke, HJHiggs, CClark, DEGill, MSavy, PJennings, NPrice, SLockey, PMNorman, DPorres, SWilson, FJones, ARamsden, NMangano, RLeggate, DAndersson, MHale, R Identification and hit-to-lead exploration of a novel series of histamine H4 receptor inverse agonists. Bioorg Med Chem Lett20:2516-9 (2010) 
 
Histamine H4 receptor
Name:Histamine H4 receptor
Type:G Protein-Coupled Receptor (GPCR)
Mol. Mass.:44517.02
Organism:Homo sapiens (Human)
Description:Binding assays were using CHO cells stably expressing hH4R receptors.
Residue:390
BDBM50315345
NameBDBM50315345
Synonyms:8-chloro-4-(4-methylpiperazin-1-yl)benzofuro[3,2-d]pyrimidine-2-carboxylic acid | CHEMBL1093139
TypeSmall organic molecule
Emp. Form.C16H15ClN4O3
Mol. Mass.346.768
SMILESCN1CCN(CC1)c1nc(nc2c3cc(Cl)ccc3oc12)C(O)=O