Reaction Details
TargetHistamine H4 receptor
LigandBDBM50315347
Substrate/Competitorn/a
Meas. Tech.ChEMBL_625969 (CHEMBL1103488)
IC50 90±n/a nM
Citation Cramp, SDyke, HJHiggs, CClark, DEGill, MSavy, PJennings, NPrice, SLockey, PMNorman, DPorres, SWilson, FJones, ARamsden, NMangano, RLeggate, DAndersson, MHale, R Identification and hit-to-lead exploration of a novel series of histamine H4 receptor inverse agonists. Bioorg Med Chem Lett20:2516-9 (2010) 
 
Histamine H4 receptor
Name:Histamine H4 receptor
Type:G Protein-Coupled Receptor (GPCR)
Mol. Mass.:44517.02
Organism:Homo sapiens (Human)
Description:Binding assays were using CHO cells stably expressing hH4R receptors.
Residue:390
BDBM50315347
NameBDBM50315347
Synonyms:8-chloro-2-methoxy-4-(4-methylpiperazin-1-yl)benzofuro[3,2-d]pyrimidine | CHEMBL1093439
TypeSmall organic molecule
Emp. Form.C16H17ClN4O2
Mol. Mass.332.785
SMILESCOc1nc(N2CCN(C)CC2)c2oc3ccc(Cl)cc3c2n1