Reaction Details
TargetHistamine H1 receptor
LigandBDBM50315348
Substrate/Competitorn/a
Meas. Tech.ChEMBL_625973 (CHEMBL1103492)
IC50>30000±n/a nM
Citation Cramp, SDyke, HJHiggs, CClark, DEGill, MSavy, PJennings, NPrice, SLockey, PMNorman, DPorres, SWilson, FJones, ARamsden, NMangano, RLeggate, DAndersson, MHale, R Identification and hit-to-lead exploration of a novel series of histamine H4 receptor inverse agonists. Bioorg Med Chem Lett20:2516-9 (2010) 
 
Histamine H1 receptor
Name:Histamine H1 receptor
Type:G Protein-Coupled Receptor (GPCR)
Mol. Mass.:55808.72
Organism:Homo sapiens (Human)
Description:Cell pellets from SK-N-MC cells transfected with human H1 receptor were used in binding assay.
Residue:487
BDBM50315348
NameBDBM50315348
Synonyms:(R)-8-chloro-4-(3-(methylamino)pyrrolidin-1-yl)benzofuro[3,2-d]pyrimidin-2-amine | CHEMBL1091874
TypeSmall organic molecule
Emp. Form.C15H16ClN5O
Mol. Mass.317.773
SMILESCN[C@@H]1CCN(C1)c1nc(N)nc2c3cc(Cl)ccc3oc12