Reaction Details
TargetAdenosine receptor A2a
LigandBDBM50315541
Substrate/Competitorn/a
Meas. Tech.ChEMBL_627304 (CHEMBL1105450)
Ki 0.016±n/a nM
Citation Mishra, CBBarodia, SKPrakash, ASenthil Kumar, JBLuthra, PM Novel 8-(furan-2-yl)-3-substituted thiazolo [5,4-e][1,2,4] triazolo[1,5-c] pyrimidine-2(3H)-thione derivatives as potential adenosine A(2A) receptor antagonists. Bioorg Med Chem18:2491-500 (2010) 
 
Adenosine receptor A2a
Name:Adenosine receptor A2a
Type:G Protein-Coupled Receptor (GPCR)
Mol. Mass.:44716.46
Organism:Homo sapiens (Human)
Description:P29274
Residue:412
BDBM50315541
NameBDBM50315541
Synonyms:8-(2-Thioxo-7(3-allyl)-2-(2-furyl)thiazole[4,3-e]1,2,4-triazolo[1, 5-c]pyrimidine | CHEMBL1092271
TypeSmall organic molecule
Emp. Form.C13H9N5OS2
Mol. Mass.315.373
SMILESC=CCn1c2ncn3nc(nc3c2sc1=S)-c1ccco1