Reaction Details
TargetAdenosine receptor A2a
LigandBDBM50048466
Substrate/Competitorn/a
Meas. Tech.ChEMBL_627304 (CHEMBL1105450)
Ki 1.23±n/a nM
Citation Mishra, CBBarodia, SKPrakash, ASenthil Kumar, JBLuthra, PM Novel 8-(furan-2-yl)-3-substituted thiazolo [5,4-e][1,2,4] triazolo[1,5-c] pyrimidine-2(3H)-thione derivatives as potential adenosine A(2A) receptor antagonists. Bioorg Med Chem18:2491-500 (2010) 
 
Adenosine receptor A2a
Name:Adenosine receptor A2a
Type:G Protein-Coupled Receptor (GPCR)
Mol. Mass.:44716.46
Organism:Homo sapiens (Human)
Description:P29274
Residue:412
BDBM50048466
NameBDBM50048466
Synonyms:2-(furan-2-yl)-7-phenethyl-7H-pyrazolo[4,3-e][1,2,4]triazolo[1,5-c]pyrimidin-5-amine 2-Furan-2-yl-7-phenethyl-7H-pyrazolo[4,3-e][1,2,4]triazolo[1,5-c]pyrimidin-5-ylamine(SCH 58261) SCH-58261 US11440916, HZ10126
TypeSmall organic molecule
Emp. Form.C18H15N7O
Mol. Mass.345.358
SMILESNc1nc2n(CCc3ccccc3)ncc2c2nc(nn12)-c1ccco1