Reaction Details
TargetTransient receptor potential cation channel subfamily V member 1
LigandBDBM50273214
Substrate/Competitorn/a
Meas. Tech.ChEMBL_627601 (CHEMBL1113607)
IC50 7.1±n/a nM
Citation Blum, CACaldwell, TZheng, XBakthavatchalam, RCapitosti, SBrielmann, HDe Lombaert, SKershaw, MTMatson, DKrause, JECortright, DCrandall, MMartin, WJMurphy, BABoyce, SJones, ABMason, GRycroft, WPerrett, HConley, RBurnaby-Davies, NChenard, BLHodgetts, KJ Discovery of novel 6,6-heterocycles as transient receptor potential vanilloid (TRPV1) antagonists. J Med Chem53:3330-48 (2010) 
 
Transient receptor potential cation channel subfamily V member 1
Name:Transient receptor potential cation channel subfamily V member 1
Type:Protein
Mol. Mass.:94960.75
Organism:Homo sapiens (Human)
Description:Q8NER1
Residue:839
BDBM50273214
NameBDBM50273214
Synonyms:7-(3-(trifluoromethyl)pyridin-2-yl)-N-(6-(trifluoromethyl)pyridin-3-yl)quinazolin-4-amine CHEMBL463382
TypeSmall organic molecule
Emp. Form.C20H11F6N5
Mol. Mass.435.3253
SMILESFC(F)(F)c1ccc(Nc2ncnc3cc(ccc23)-c2ncccc2C(F)(F)F)cn1