Reaction Details
TargetMelanocortin receptor 4
LigandBDBM50315685
Substrate/Competitorn/a
Meas. Tech.ChEMBL_624023 (CHEMBL1116909)
Ki 844±n/a nM
Citation Lansdell, MIHepworth, DCalabrese, ABrown, ADBlagg, JBurring, DJWilson, PFradet, DBrown, TBQuinton, FMistry, NTang, KMount, NStacey, PEdmunds, NAdams, CGaboardi, SNeal-Morgan, SWayman, CCole, SPhipps, JLewis, MVerrier, HGillon, VFeeder, NHeatherington, ASultana, SHaughie, SMartin, SWSudworth, MTweedy, S Discovery of a selective small-molecule melanocortin-4 receptor agonist with efficacy in a pilot study of sexual dysfunction in humans. J Med Chem53:3183-97 (2010) 
 
Melanocortin receptor 4
Name:Melanocortin receptor 4
Type:Enzyme
Mol. Mass.:36949.50
Organism:Homo sapiens (Human)
Description:P32245
Residue:332
BDBM50315685
NameBDBM50315685
Synonyms:((3S,4R)-1-tert-butyl-4-(2,4-difluorophenyl)pyrrolidin-3-yl)((3S,4R,5R)-4-hydroxy-3,5-dimethyl-4-propylpiperidin-1-yl)methanone | CHEMBL1090161
TypeSmall organic molecule
Emp. Form.C25H38F2N2O2
Mol. Mass.436.5782
SMILESCCC[C@]1(O)[C@@H](C)CN(C[C@H]1C)C(=O)[C@@H]1CN(C[C@H]1c1ccc(F)cc1F)C(C)(C)C