Reaction Details
TargetMelanocortin receptor 3
LigandBDBM50315682
Substrate/Competitorn/a
Meas. Tech.ChEMBL_624017 (CHEMBL1116903)
EC50>13500±n/a nM
Citation Lansdell, MIHepworth, DCalabrese, ABrown, ADBlagg, JBurring, DJWilson, PFradet, DBrown, TBQuinton, FMistry, NTang, KMount, NStacey, PEdmunds, NAdams, CGaboardi, SNeal-Morgan, SWayman, CCole, SPhipps, JLewis, MVerrier, HGillon, VFeeder, NHeatherington, ASultana, SHaughie, SMartin, SWSudworth, MTweedy, S Discovery of a selective small-molecule melanocortin-4 receptor agonist with efficacy in a pilot study of sexual dysfunction in humans. J Med Chem53:3183-97 (2010) 
 
Melanocortin receptor 3
Name:Melanocortin receptor 3
Type:Enzyme
Mol. Mass.:36044.86
Organism:Homo sapiens (Human)
Description:P41968
Residue:323
BDBM50315682
NameBDBM50315682
Synonyms:((3S,4R)-4-(2,4-difluorophenyl)-1-ethylpyrrolidin-3-yl)((3S,4R,5R)-4-(3-fluorophenyl)-4-hydroxy-3,5-dimethylpiperidin-1-yl)methanone | CHEMBL1090885
TypeSmall organic molecule
Emp. Form.C26H31F3N2O2
Mol. Mass.460.5317
SMILESCCN1C[C@H]([C@@H](C1)c1ccc(F)cc1F)C(=O)N1C[C@H](C)[C@](O)([C@H](C)C1)c1cccc(F)c1