Reaction Details
TargetMelanocortin receptor 4
LigandBDBM50315688
Substrate/Competitorn/a
Meas. Tech.ChEMBL_624014 (CHEMBL1108859)
EC50 45±n/a nM
Citation Lansdell, MIHepworth, DCalabrese, ABrown, ADBlagg, JBurring, DJWilson, PFradet, DBrown, TBQuinton, FMistry, NTang, KMount, NStacey, PEdmunds, NAdams, CGaboardi, SNeal-Morgan, SWayman, CCole, SPhipps, JLewis, MVerrier, HGillon, VFeeder, NHeatherington, ASultana, SHaughie, SMartin, SWSudworth, MTweedy, S Discovery of a selective small-molecule melanocortin-4 receptor agonist with efficacy in a pilot study of sexual dysfunction in humans. J Med Chem53:3183-97 (2010) 
 
Melanocortin receptor 4
Name:Melanocortin receptor 4
Type:Enzyme
Mol. Mass.:36949.50
Organism:Homo sapiens (Human)
Description:P32245
Residue:332
BDBM50315688
NameBDBM50315688
Synonyms:((3S,4R)-1-tert-butyl-4-(2,4-difluorophenyl)pyrrolidin-3-yl)((3S,4R,5R)-4-(2,6-difluorophenyl)-4-hydroxy-3,5-dimethylpiperidin-1-yl)methanone | CHEMBL1092550
TypeSmall organic molecule
Emp. Form.C28H34F4N2O2
Mol. Mass.506.5754
SMILESC[C@H]1CN(C[C@@H](C)[C@]1(O)c1c(F)cccc1F)C(=O)[C@@H]1CN(C[C@H]1c1ccc(F)cc1F)C(C)(C)C