Reaction Details
TargetPotassium voltage-gated channel subfamily H member 2
LigandBDBM50315686
Substrate/Competitorn/a
Meas. Tech.ChEMBL_624022 (CHEMBL1116908)
Ki 5.8±n/a nM
Citation Lansdell, MIHepworth, DCalabrese, ABrown, ADBlagg, JBurring, DJWilson, PFradet, DBrown, TBQuinton, FMistry, NTang, KMount, NStacey, PEdmunds, NAdams, CGaboardi, SNeal-Morgan, SWayman, CCole, SPhipps, JLewis, MVerrier, HGillon, VFeeder, NHeatherington, ASultana, SHaughie, SMartin, SWSudworth, MTweedy, S Discovery of a selective small-molecule melanocortin-4 receptor agonist with efficacy in a pilot study of sexual dysfunction in humans. J Med Chem53:3183-97 (2010) 
 
Potassium voltage-gated channel subfamily H member 2
Name:Potassium voltage-gated channel subfamily H member 2
Type:Multi-pass membrane protein
Mol. Mass.:126672.65
Organism:Homo sapiens (Human)
Description:Q12809
Residue:1159
BDBM50315686
NameBDBM50315686
Synonyms:((3S,4R)-1-tert-butyl-4-(2,4-difluorophenyl)pyrrolidin-3-yl)((3S,4R,5R)-4-hydroxy-3,5-dimethyl-4-(pyridin-2-yl)piperidin-1-yl)methanone | CHEMBL1089830
TypeSmall organic molecule
Emp. Form.C27H35F2N3O2
Mol. Mass.471.5825
SMILESC[C@H]1CN(C[C@@H](C)[C@]1(O)c1ccccn1)C(=O)[C@@H]1CN(C[C@H]1c1ccc(F)cc1F)C(C)(C)C