Reaction Details
TargetGlucocorticoid receptor
LigandBDBM18627
Substrate/Competitorn/a
Meas. Tech.ChEMBL_624272 (CHEMBL1106116)
Ki 0.24±n/a nM
Citation Onnis, VKinsella, GKCarta, GJagoe, WNPrice, TWilliams, DCFayne, DLloyd, DG Virtual screening for the identification of novel nonsteroidal glucocorticoid modulators. J Med Chem53:3065-74 (2010) 
 
Glucocorticoid receptor
Name:Glucocorticoid receptor
Type:Enzyme
Mol. Mass.:85656.87
Organism:Homo sapiens (Human)
Description:P04150
Residue:777
BDBM18627
NameBDBM18627
Synonyms:(10S,11S,14S,15S,17R)-17-[4-(dimethylamino)phenyl]-14-hydroxy-15-methyl-14-(prop-1-yn-1-yl)tetracyclo[8.7.0.0^{2,7}.0^{11,15}]heptadeca-1,6-dien-5-one Mifepristone RU486 (tetramethyl-rhodamine conjugated)
TypeSmall organic molecule
Emp. Form.C29H35NO2
Mol. Mass.429.5937
SMILES[H][C@@]12CC[C@@](O)(C#CC)[C@@]1(C)C[C@@H](C1=C3CCC(=O)C=C3CC[C@@]21[H])c1ccc(cc1)N(C)C