Reaction Details
TargetEctonucleotide pyrophosphatase/phosphodiesterase family member 2
LigandBDBM50316087
Substrate/Competitorn/a
Meas. Tech.ChEMBL_623314 (CHEMBL1115237)
Ki 1140±n/a nM
Citation North, EJHoward, ALWanjala, IWPham, TCBaker, DLParrill, AL Pharmacophore development and application toward the identification of novel, small-molecule autotaxin inhibitors. J Med Chem53:3095-105 (2010) 
 
Ectonucleotide pyrophosphatase/phosphodiesterase family member 2
Name:Ectonucleotide pyrophosphatase/phosphodiesterase family member 2
Type:Enzyme
Mol. Mass.:99007.13
Organism:Homo sapiens (Human)
Description:Q13822
Residue:863
BDBM50316087
NameBDBM50316087
Synonyms:7-[(4-{[4-({4-[(6,8-disulfonaphthalen-2-yl)carbamoyl]phenyl}amino)-2,5-dihydroxy-3,6-dioxocyclohexa-1,4-dien-1-yl]amino}benzene)amido]naphthalene-1,3-disulfonic acid | CHEMBL1091758
TypeSmall organic molecule
Emp. Form.C40H28N4O18S4
Mol. Mass.980.926
SMILESOC1=C(Nc2ccc(cc2)C(=O)Nc2ccc3cc(cc(c3c2)S(O)(=O)=O)S(O)(=O)=O)C(=O)C(O)=C(Nc2ccc(cc2)C(=O)Nc2ccc3cc(cc(c3c2)S(O)(=O)=O)S(O)(=O)=O)C1=O