Reaction Details
TargetAndrogen receptor
LigandBDBM50367916
Substrate/Competitorn/a
Meas. Tech.ChEMBL_628924 (CHEMBL1116293)
Kd 0.6±n/a nM
Citation Zhou, HBLee, JHMayne, CGCarlson, KEKatzenellenbogen, JA Imaging progesterone receptor in breast tumors: synthesis and receptor binding affinity of fluoroalkyl-substituted analogues of tanaproget. J Med Chem53:3349-60 (2010) 
 
Androgen receptor
Name:Androgen receptor
Type:Receptor
Mol. Mass.:99185.27
Organism:Homo sapiens (Human)
Description:CHO cells were stably transfected with human AR gene.
Residue:920
BDBM50367916
NameBDBM50367916
Synonyms:METHYLTRIENOLONE R-1881
TypeSmall organic molecule
Emp. Form.C19H24O2
Mol. Mass.284.3927
SMILESC[C@]1(O)CC[C@H]2[C@@H]3CCC4=CC(=O)CCC4=C3C=C[C@]12C