Reaction Details
TargetAurora kinase B
LigandBDBM50316473
Substrate/Competitorn/a
Meas. Tech.ChEMBL_630516 (CHEMBL1104788)
IC50 1.4±n/a nM
Citation Adams, NDAdams, JLBurgess, JLChaudhari, AMCopeland, RADonatelli, CADrewry, DHFisher, KEHamajima, THardwicke, MAHuffman, WFKoretke-Brown, KKLai, ZVMcDonald, OBNakamura, HNewlander, KAOleykowski, CAParrish, CAPatrick, DRPlant, RSarpong, MASasaki, KSchmidt, SJSilva, DJSutton, DTang, JThompson, CSTummino, PJWang, JCXiang, HYang, JDhanak, D Discovery of GSK1070916, a potent and selective inhibitor of Aurora B/C kinase. J Med Chem53:3973-4001 (2010) 
 
Aurora kinase B
Name:Aurora kinase B
Type:Protein
Mol. Mass.:39327.72
Organism:Homo sapiens (Human)
Description:Q96GD4
Residue:344
BDBM50316473
NameBDBM50316473
Synonyms:4-[3-(4-N-Ethylcarbamylaminophenyl)-1-ethyl-1H-pyrazol-4-yl]-2-[3-(N-pyrrolidinylmethyl)phenyl]-1H-pyrrolo[2,3-b]pyridine | CHEMBL1095475
TypeSmall organic molecule
Emp. Form.C32H35N7O
Mol. Mass.533.6666
SMILESCCNC(=O)Nc1ccc(cc1)-c1nn(CC)cc1-c1ccnc2[nH]c(cc12)-c1cccc(CN2CCCC2)c1